F                                                                        [100%]
=================================== FAILURES ===================================
_____________________________________ test _____________________________________

    def test():
    
>       assert False
E       assert False

f.py:3: AssertionError
=========================== short test summary info ============================
FAILED f.py::test - assert False
1 failed in 0.01s