============================= test session starts ==============================
platform linux -- Python 3.9.6, pytest-6.2.4, py-1.10.0, pluggy-0.13.1
rootdir: /tmp/pytest-of-runner/pytest-0/test_blank_code_line0
collected 1 item

f.py F                                                                   [100%]

=================================== FAILURES ===================================
_____________________________________ test _____________________________________

    def test():
    
>       assert False
E       assert False

f.py:3: AssertionError
=========================== short test summary info ============================
FAILED f.py::test - assert False
============================== 1 failed in 0.01s ===============================